Linux.com

Home Linux Community Forums Software Installation gcc-4.4.3 installation error

gcc-4.4.3 installation error

Link to this post 31 Mar 10

checking host system type... x86_64-unknown-linux-gnu
checking for x86_64-unknown-linux-gnu-ar... ar
checking for x86_64-unknown-linux-gnu-lipo... lipo
checking for x86_64-unknown-linux-gnu-nm... /home/abc/gcc-4.4.3/host-x86_64-unknown-linux-gnu/gcc/nm
checking for x86_64-unknown-linux-gnu-ranlib... ranlib
checking for x86_64-unknown-linux-gnu-strip... strip
checking whether ln -s works... yes
checking for x86_64-unknown-linux-gnu-gcc... /home/abc/gcc-4.4.3/host-x86_64-unknown-linux-gnu/gcc/xgcc -B/home/abc/gcc-4.4.3/host-x86_64-unknown-linux-gnu/gcc/ -B/home/abc/gcc-443/x86_64-unknown-linux-gnu/bin/ -B/home/abc/gcc-443/x86_64-unknown-linux-gnu/lib/ -isystem /home/abc/gcc-443/x86_64-unknown-linux-gnu/include -isystem /home/abc/gcc-443/x86_64-unknown-linux-gnu/sys-include
checking for suffix of object files... configure: error: in `/home/abc/gcc-4.4.3/x86_64-unknown-linux-gnu/libgcc':
configure: error: cannot compute suffix of object files: cannot compile
See `config.log' for more details.
make[2]: *** [configure-stage1-target-libgcc] Error 1
make[2]: Leaving directory `/home/abc/gcc-4.4.3'
make[1]: *** [stage1-bubble] Error 2

Who we are ?

The Linux Foundation is a non-profit consortium dedicated to the growth of Linux.

More About the foundation...

Frequent Questions

Join / Linux Training / Board