Linux.com

pankajd

pankajd

  • Linux.com Member
  • Posts: 4
  • Member Since: 19 Nov 09
  • Last Logged In: 24 Jul 10

Latest Posts

Posted by
Topic
Post Preview
Posted
  • pankajd
    error while installing vlc
    Hi, we have p4 box having CentOS release 4.4 (Final) 2.6.9-42.EL #1 Sat Aug 12 09:17:58 CDT 2006 i686 i686 i386 GNU/Linux. we are unable to install vlc package. Unfortunately we can not upgrade the os/kernel After doing "yum install vlc", it gives error --> Running transaction check --> Processing Dependency: libsndfile.so.1 for package: twolame --> Processing Dependency: libsndfile.so.1(libsndfile.so.1.0) for package: twolame --> Processing Dependency: libdvdcss >= 1.2.5 for package: libdvdread --> Processing Dependency: libcucul.so.0 for package: vlc --> Restarting Dependency Resolution with new changes. --> Populating transaction set with selected packages. Please wait. ---> Package libdvdcss.i386 0:1.2.10-1.el4.rf set to be updated ---> Package libsndfile.i386 0:1.0.17-1.el4.rf set to be updated --> Running transaction check --> Processing Dependency: libcucul.so.0 for package: vlc --> Finished Dependency Resolution Error: Missing Dependency: libcucul.so.0 is needed by package vlc what needs to be done..?is it a bug?
    Link to this post 24 Jul 10

    Hi,

    we have p4 box having CentOS release 4.4 (Final) 2.6.9-42.EL #1 Sat Aug 12 09:17:58 CDT 2006 i686 i686 i386 GNU/Linux.

    we are unable to install vlc package. Unfortunately we can not upgrade the os/kernel

    After doing "yum install vlc", it gives error

    --> Running transaction check
    --> Processing Dependency: libsndfile.so.1 for package: twolame
    --> Processing Dependency: libsndfile.so.1(libsndfile.so.1.0) for package: twolame
    --> Processing Dependency: libdvdcss >= 1.2.5 for package: libdvdread
    --> Processing Dependency: libcucul.so.0 for package: vlc
    --> Restarting Dependency Resolution with new changes.
    --> Populating transaction set with selected packages. Please wait.
    ---> Package libdvdcss.i386 0:1.2.10-1.el4.rf set to be updated
    ---> Package libsndfile.i386 0:1.0.17-1.el4.rf set to be updated
    --> Running transaction check
    --> Processing Dependency: libcucul.so.0 for package: vlc
    --> Finished Dependency Resolution
    Error: Missing Dependency: libcucul.so.0 is needed by package vlc

    what needs to be done..?is it a bug?

  • pankajd
    gcc 4.4.3 compilation error
    hi,i am trying to compile gcc 4.4.3 and getting errors: some of my config lig file output is : ## --------- ## ## Platform. ## ## --------- ## hostname = amd00.linuc.elite.in uname -m = x86_64 uname -r = 2.6.9-42.0.2.EL_lustre.1.4.7.3smp uname -s = Linux uname -v = #1 SMP Fri Nov 10 18:59:29 MST 2006 /usr/bin/uname -p = unknown /bin/uname -X = unknown /bin/arch = x86_64 /usr/bin/arch -k = unknown /usr/convex/getsysinfo = unknown hostinfo = unknown /bin/machine = unknown /usr/bin/oslevel = unknown /bin/universe = unknown PATH: /usr/local/maui/bin PATH: /usr/local/bin PATH: /usr/X11R6/bin PATH: /usr/local/maui/bin PATH: /opt/intel/fce/10.0.023/bin PATH: /opt/intel/idbe/10.0.023/bin PATH: /opt/intel/ict/3.0.1/itac/7.0.1/bin PATH: /opt/intel/cce/10.0.023/bin PATH: /usr/local/gt4/bin PATH: /usr/local/gt4/sbin PATH: /opt/intel/idbe/9.1.032/bin PATH: /opt/intel/fce/9.1.032/bin PATH: /opt/intel/cce/9.1.038/bin PATH: /usr/local/bin PATH: /bin PATH: /usr/bin PATH: /usr/X11R6/bin PATH: /opt/pathscale/bin configure:2861: $? = 0 configure:2879: result: none needed configure:2897: /home/external/symbiosis/rajashreej/gcc-4.4.3/host-x86_64-unknown-linux-gnu/gcc/xgcc -B/home/external/symbiosis/rajashreej/gcc-4.4.3/host-x86_ 64-unknown-linux-gnu/gcc/ -B/home/external/symbiosis/rajashreej/gcc-443/x86_64-unknown-linux-gnu/bin/ -B/home/external/symbiosis/rajashreej/gcc-443/x86_64-unk nown-linux-gnu/lib/ -isystem /home/external/symbiosis/rajashreej/gcc-443/x86_64-unknown-linux-gnu/include -isystem /home/external/symbiosis/rajashreej/gcc-443 /x86_64-unknown-linux-gnu/sys-include -c -g -O2 conftest.c >&5 conftest.c:2: error: expected '=', ',', ';', 'asm' or '__attribute__' before 'me' configure:2903: $? = 1 configure: failed program was: | #ifndef __cplusplus | choke me | #endif configure:3041: checking how to run the C preprocessor configure:3076: /home/external/symbiosis/rajashreej/gcc-4.4.3/host-x86_64-unknown-linux-gnu/gcc/xgcc -B/home/external/symbiosis/rajashreej/gcc-4.4.3/host-x86_ 64-unknown-linux-gnu/gcc/ -B/home/external/symbiosis/rajashreej/gcc-443/x86_64-unknown-linux-gnu/bin/ -B/home/external/symbiosis/rajashreej/gcc-443/x86_64-unk nown-linux-gnu/lib/ -isystem /home/external/symbiosis/rajashreej/gcc-443/x86_64-unknown-linux-gnu/include -isystem /home/external/symbiosis/rajashreej/gcc-443 /x86_64-unknown-linux-gnu/sys-include -E conftest.c configure:3082: $? = 0 configure:3114: /home/external/symbiosis/rajashreej/gcc-4.4.3/host-x86_64-unknown-linux-gnu/gcc/xgcc -B/home/external/symbiosis/rajashreej/gcc-4.4.3/host-x86_ 64-unknown-linux-gnu/gcc/ -B/home/external/symbiosis/rajashreej/gcc-443/x86_64-unknown-linux-gnu/bin/ -B/home/external/symbiosis/rajashreej/gcc-443/x86_64-unk nown-linux-gnu/lib/ -isystem /home/external/symbiosis/rajashreej/gcc-443/x86_64-unknown-linux-gnu/include -isystem /home/external/symbiosis/rajashreej/gcc-443 /x86_64-unknown-linux-gnu/sys-include -E conftest.c conftest.c:9:28: error: ac_nonexistent.h: No such file or directory configure:3120: $? = 1 configure: failed program was: | /* confdefs.h. */ | | #define PACKAGE_NAME "GNU C Runtime Library" | #define PACKAGE_TARNAME "libgcc" | #define PACKAGE_VERSION "1.0" | #define PACKAGE_STRING "GNU C Runtime Library 1.0" | #define PACKAGE_BUGREPORT "" | /* end confdefs.h. */
    Link to this post 03 Apr 10

    hi,i am trying to compile gcc 4.4.3 and getting errors:
    some of my config lig file output is :
    ## --------- ##
    ## Platform. ##
    ## --------- ##

    hostname = amd00.linuc.elite.in
    uname -m = x86_64
    uname -r = 2.6.9-42.0.2.EL_lustre.1.4.7.3smp
    uname -s = Linux
    uname -v = #1 SMP Fri Nov 10 18:59:29 MST 2006

    /usr/bin/uname -p = unknown
    /bin/uname -X = unknown

    /bin/arch = x86_64
    /usr/bin/arch -k = unknown
    /usr/convex/getsysinfo = unknown
    hostinfo = unknown
    /bin/machine = unknown
    /usr/bin/oslevel = unknown
    /bin/universe = unknown

    PATH: /usr/local/maui/bin
    PATH: /usr/local/bin
    PATH: /usr/X11R6/bin
    PATH: /usr/local/maui/bin
    PATH: /opt/intel/fce/10.0.023/bin
    PATH: /opt/intel/idbe/10.0.023/bin
    PATH: /opt/intel/ict/3.0.1/itac/7.0.1/bin
    PATH: /opt/intel/cce/10.0.023/bin
    PATH: /usr/local/gt4/bin
    PATH: /usr/local/gt4/sbin
    PATH: /opt/intel/idbe/9.1.032/bin
    PATH: /opt/intel/fce/9.1.032/bin
    PATH: /opt/intel/cce/9.1.038/bin
    PATH: /usr/local/bin
    PATH: /bin
    PATH: /usr/bin
    PATH: /usr/X11R6/bin
    PATH: /opt/pathscale/bin

    configure:2861: $? = 0
    configure:2879: result: none needed
    configure:2897: /home/external/symbiosis/rajashreej/gcc-4.4.3/host-x86_64-unknown-linux-gnu/gcc/xgcc -B/home/external/symbiosis/rajashreej/gcc-4.4.3/host-x86_
    64-unknown-linux-gnu/gcc/ -B/home/external/symbiosis/rajashreej/gcc-443/x86_64-unknown-linux-gnu/bin/ -B/home/external/symbiosis/rajashreej/gcc-443/x86_64-unk
    nown-linux-gnu/lib/ -isystem /home/external/symbiosis/rajashreej/gcc-443/x86_64-unknown-linux-gnu/include -isystem /home/external/symbiosis/rajashreej/gcc-443
    /x86_64-unknown-linux-gnu/sys-include -c -g -O2 conftest.c >&5
    conftest.c:2: error: expected '=', ',', ';', 'asm' or '__attribute__' before 'me'
    configure:2903: $? = 1
    configure: failed program was:
    | #ifndef __cplusplus
    | choke me
    | #endif
    configure:3041: checking how to run the C preprocessor
    configure:3076: /home/external/symbiosis/rajashreej/gcc-4.4.3/host-x86_64-unknown-linux-gnu/gcc/xgcc -B/home/external/symbiosis/rajashreej/gcc-4.4.3/host-x86_
    64-unknown-linux-gnu/gcc/ -B/home/external/symbiosis/rajashreej/gcc-443/x86_64-unknown-linux-gnu/bin/ -B/home/external/symbiosis/rajashreej/gcc-443/x86_64-unk
    nown-linux-gnu/lib/ -isystem /home/external/symbiosis/rajashreej/gcc-443/x86_64-unknown-linux-gnu/include -isystem /home/external/symbiosis/rajashreej/gcc-443
    /x86_64-unknown-linux-gnu/sys-include -E conftest.c
    configure:3082: $? = 0
    configure:3114: /home/external/symbiosis/rajashreej/gcc-4.4.3/host-x86_64-unknown-linux-gnu/gcc/xgcc -B/home/external/symbiosis/rajashreej/gcc-4.4.3/host-x86_
    64-unknown-linux-gnu/gcc/ -B/home/external/symbiosis/rajashreej/gcc-443/x86_64-unknown-linux-gnu/bin/ -B/home/external/symbiosis/rajashreej/gcc-443/x86_64-unk
    nown-linux-gnu/lib/ -isystem /home/external/symbiosis/rajashreej/gcc-443/x86_64-unknown-linux-gnu/include -isystem /home/external/symbiosis/rajashreej/gcc-443
    /x86_64-unknown-linux-gnu/sys-include -E conftest.c
    conftest.c:9:28: error: ac_nonexistent.h: No such file or directory
    configure:3120: $? = 1
    configure: failed program was:
    | /* confdefs.h. */
    |
    | #define PACKAGE_NAME "GNU C Runtime Library"
    | #define PACKAGE_TARNAME "libgcc"
    | #define PACKAGE_VERSION "1.0"
    | #define PACKAGE_STRING "GNU C Runtime Library 1.0"
    | #define PACKAGE_BUGREPORT ""
    | /* end confdefs.h. */

  • pankajd
    gcc-4.4.3 installation error
    checking host system type... x86_64-unknown-linux-gnu checking for x86_64-unknown-linux-gnu-ar... ar checking for x86_64-unknown-linux-gnu-lipo... lipo checking for x86_64-unknown-linux-gnu-nm... /home/abc/gcc-4.4.3/host-x86_64-unknown-linux-gnu/gcc/nm checking for x86_64-unknown-linux-gnu-ranlib... ranlib checking for x86_64-unknown-linux-gnu-strip... strip checking whether ln -s works... yes checking for x86_64-unknown-linux-gnu-gcc... /home/abc/gcc-4.4.3/host-x86_64-unknown-linux-gnu/gcc/xgcc -B/home/abc/gcc-4.4.3/host-x86_64-unknown-linux-gnu/gcc/ -B/home/abc/gcc-443/x86_64-unknown-linux-gnu/bin/ -B/home/abc/gcc-443/x86_64-unknown-linux-gnu/lib/ -isystem /home/abc/gcc-443/x86_64-unknown-linux-gnu/include -isystem /home/abc/gcc-443/x86_64-unknown-linux-gnu/sys-include checking for suffix of object files... configure: error: in `/home/abc/gcc-4.4.3/x86_64-unknown-linux-gnu/libgcc': configure: error: cannot compute suffix of object files: cannot compile See `config.log' for more details. make[2]: *** [configure-stage1-target-libgcc] Error 1 make[2]: Leaving directory `/home/abc/gcc-4.4.3' make[1]: *** [stage1-bubble] Error 2
    Link to this post 31 Mar 10

    checking host system type... x86_64-unknown-linux-gnu
    checking for x86_64-unknown-linux-gnu-ar... ar
    checking for x86_64-unknown-linux-gnu-lipo... lipo
    checking for x86_64-unknown-linux-gnu-nm... /home/abc/gcc-4.4.3/host-x86_64-unknown-linux-gnu/gcc/nm
    checking for x86_64-unknown-linux-gnu-ranlib... ranlib
    checking for x86_64-unknown-linux-gnu-strip... strip
    checking whether ln -s works... yes
    checking for x86_64-unknown-linux-gnu-gcc... /home/abc/gcc-4.4.3/host-x86_64-unknown-linux-gnu/gcc/xgcc -B/home/abc/gcc-4.4.3/host-x86_64-unknown-linux-gnu/gcc/ -B/home/abc/gcc-443/x86_64-unknown-linux-gnu/bin/ -B/home/abc/gcc-443/x86_64-unknown-linux-gnu/lib/ -isystem /home/abc/gcc-443/x86_64-unknown-linux-gnu/include -isystem /home/abc/gcc-443/x86_64-unknown-linux-gnu/sys-include
    checking for suffix of object files... configure: error: in `/home/abc/gcc-4.4.3/x86_64-unknown-linux-gnu/libgcc':
    configure: error: cannot compute suffix of object files: cannot compile
    See `config.log' for more details.
    make[2]: *** [configure-stage1-target-libgcc] Error 1
    make[2]: Leaving directory `/home/abc/gcc-4.4.3'
    make[1]: *** [stage1-bubble] Error 2

  • pankajd
    access console of a switch : problem
    how to access console of a switch having rj45 on switch side to db 9 female on pc side console cable which needs to be connected to one console server having rj11 on its side and db 9 female on other end.i.e. on switch side,console cable has rj45 and db 9 pin female connector on other side of the console cable which has come with switch.Now i have to connect this switch using console server which has a cable having rj11 on that server side and other end is db 9 pin female .Now i hv to connect switch serial console cable to console server serial console cable using some consverter or some cable which can connect both db 9 female connectors.how to do that?i hv linux as os and minicom and console utilities.
    Link to this post 12 Jan 10

    how to access console of a switch having rj45 on switch side to db 9 female on pc side console cable which needs to be connected to one console server having rj11 on its side and db 9 female on other end.i.e. on switch side,console cable has rj45 and db 9 pin female connector on other side of the console cable which has come with switch.Now i have to connect this switch using console server which has a cable having rj11 on that server side and other end is db 9 pin female .Now i hv to connect switch serial console cable to console server serial console cable using some consverter or some cable which can connect both db 9 female connectors.how to do that?i hv linux as os and minicom and console utilities.

Who we are ?

The Linux Foundation is a non-profit consortium dedicated to the growth of Linux.

More About the foundation...

Frequent Questions

Join / Linux Training / Board